BDBM50261104 (E)-methyl 2-(1-dodecyl-2-oxoindolin-3-ylidene)acetate::CHEMBL493805
SMILES CCCCCCCCCCCCN1C(=O)\C(=C\C(=O)OC)c2ccccc12
InChI Key InChIKey=TWGIQFJNSRSFHH-CZIZESTLSA-N
Data  1 IC50
  Tab Delimited (TSV)   2D SDfile   Computed 3D by Vconf -m prep SDfile
Find this compound or compounds like it in BindingDB:
Activity Spreadsheet -- Enzyme Inhibition Constant Data from BindingDB
Found 1 hit for monomerid = 50261104
TargetM-phase inducer phosphatase 1(Homo sapiens (Human))
Doshisha Women'S College Of Liberal Arts
Curated by ChEMBL
LigandPNGBDBM50261104((E)-methyl 2-(1-dodecyl-2-oxoindolin-3-ylidene)ace...)
Affinity DataIC50:  3.70E+4nM. Assay description: Inhibition of human Cdc25A phosphatase activity
In DepthDetails ArticlePubMed