BDBM50261105 2-(1-dodecyl-2-oxoindolin-3-yl)acetic acid::CHEMBL493812
SMILES CCCCCCCCCCCCN1C(=O)C(CC(O)=O)c2ccccc12
InChI Key InChIKey=FXBQGXWQPVHXTL-UHFFFAOYSA-N
Data  1 IC50
  Tab Delimited (TSV)   2D SDfile   Computed 3D by Vconf -m prep SDfile
Find this compound or compounds like it in BindingDB:
Activity Spreadsheet -- Enzyme Inhibition Constant Data from BindingDB
Found 1 hit for monomerid = 50261105
TargetM-phase inducer phosphatase 1(Homo sapiens (Human))
Doshisha Women'S College Of Liberal Arts
Curated by ChEMBL
LigandPNGBDBM50261105(2-(1-dodecyl-2-oxoindolin-3-yl)acetic acid | CHEMB...)
Affinity DataIC50:  5.00E+4nM. Assay description: Inhibition of human Cdc25A phosphatase activity
In DepthDetails ArticlePubMed