BDBM50262595 2-((2S,3R,4S)-4-benzamido-1-benzoyl-3-hydroxy-6-((2-methoxyethoxy)methoxy)-1,2,3,4-tetrahydroquinolin-2-yl)acetic acid::CHEMBL477788
SMILES COCCOCOc1ccc2N([C@@H](CC(O)=O)[C@H](O)[C@@H](NC(=O)c3ccccc3)c2c1)C(=O)c1ccccc1
InChI Key InChIKey=WOFXLYGJQVCJPU-URORMMCBSA-N
Data  1 Kd
  Tab Delimited (TSV)   2D SDfile   Computed 3D by Vconf -m prep SDfile
Find this compound or compounds like it in BindingDB:
Activity Spreadsheet -- Enzyme Inhibition Constant Data from BindingDB
Found 1 hit for monomerid = 50262595
TargetBcl2-associated agonist of cell death(Mus musculus (mouse))
Entremed
Curated by ChEMBL
LigandPNGBDBM50262595(2-((2S,3R,4S)-4-benzamido-1-benzoyl-3-hydroxy-6-((...)
Affinity DataKd: >5.00E+6nM. Assay description: Binding affinity to mouse Bcl-XL expressed in Escherichia coli BL21 cells
In DepthDetails ArticlePubMed