BDBM50262627 CHEMBL476313::Propane-1-sulfonic acid biphenyl-2-ylmethyl-(S)-pyrrolidin-3-yl-amide
SMILES CCCS(=O)(=O)N(Cc1ccccc1-c1ccccc1)[C@H]1CCNC1
InChI Key InChIKey=BYZZRTNQROTLCL-IBGZPJMESA-N
Data  3 KI  1 IC50
  Tab Delimited (TSV)   2D SDfile   Computed 3D by Vconf -m prep SDfile
Find this compound or compounds like it in BindingDB:
Activity Spreadsheet -- Enzyme Inhibition Constant Data from BindingDB
Found 4 hits for monomerid = 50262627
TargetSodium-dependent noradrenaline transporter(Homo sapiens (Human))
Pfizer
Curated by ChEMBL
LigandPNGBDBM50262627(CHEMBL476313 | Propane-1-sulfonic acid biphenyl-2-...)
Affinity DataKi:  7nM. Assay description: Inhibition of [3H]nisoxetine reuptake at human NET expressed in HEK293 cells by SPA
In DepthDetails ArticlePubMed
TargetSodium-dependent dopamine transporter(Homo sapiens (Human))
Pfizer
Curated by ChEMBL
LigandPNGBDBM50262627(CHEMBL476313 | Propane-1-sulfonic acid biphenyl-2-...)
Affinity DataKi:  2.07E+3nM. Assay description: Inhibition of [3H]dopamine reuptake at human DAT expressed in HEK293 cells by SPA
In DepthDetails ArticlePubMed
TargetSodium-dependent serotonin transporter(Homo sapiens (Human))
Pfizer
Curated by ChEMBL
LigandPNGBDBM50262627(CHEMBL476313 | Propane-1-sulfonic acid biphenyl-2-...)
Affinity DataKi:  5.68E+3nM. Assay description: Inhibition of [3H]citalopram uptake at human 5HTT expressed in HEK293 cells by SPA
In DepthDetails ArticlePubMed
TargetCytochrome P450 2D6(Homo sapiens (Human))
Pfizer
Curated by ChEMBL
LigandPNGBDBM50262627(CHEMBL476313 | Propane-1-sulfonic acid biphenyl-2-...)
Affinity DataIC50:  185nM. Assay description: Inhibition of CYP2D6 (unknown origin)
In DepthDetails ArticlePubMed