BDBM50266237 (S)-2-(3,4-dichlorophenyl)-N-(2-oxotetrahydrofuran-3-yl)acetamide::CHEMBL509975
SMILES Clc1ccc(CC(=O)N[C@H]2CCOC2=O)cc1Cl
InChI Key InChIKey=JBCVACDPJGBJKE-JTQLQIEISA-N
Data  1 IC50
  Tab Delimited (TSV)   2D SDfile   Computed 3D by Vconf -m prep SDfile
Find this compound or compounds like it in BindingDB:
Activity Spreadsheet -- Enzyme Inhibition Constant Data from BindingDB
Found 1 hit for monomerid = 50266237
TargetTranscriptional activator protein TraR(Rhizobium radiobacter)
University Of Wisconsin-Madison
Curated by ChEMBL
LigandPNGBDBM50266237((S)-2-(3,4-dichlorophenyl)-N-(2-oxotetrahydrofuran...)
Affinity DataIC50:  2.40E+3nM. Assay description: Antagonist activity at Agrobacterium tumefaciens WCF47 TraR receptor assessed as inhibition of OOHL-induced response by beta-galctosidase reporter ge...
In DepthDetails ArticlePubMed