BDBM50266267 (S)-N-(2-oxotetrahydrofuran-3-yl)-2-(p-tolyloxy)acetamide::CHEMBL456058
SMILES Cc1ccc(OCC(=O)N[C@H]2CCOC2=O)cc1
InChI Key InChIKey=JVOMVGTZFJDPIV-NSHDSACASA-N
Data  1 IC50
  Tab Delimited (TSV)   2D SDfile   Computed 3D by Vconf -m prep SDfile
Find this compound or compounds like it in BindingDB:
Activity Spreadsheet -- Enzyme Inhibition Constant Data from BindingDB
Found 1 hit for monomerid = 50266267
TargetTranscriptional activator protein TraR(Rhizobium radiobacter)
University Of Wisconsin-Madison
Curated by ChEMBL
LigandPNGBDBM50266267((S)-N-(2-oxotetrahydrofuran-3-yl)-2-(p-tolyloxy)ac...)
Affinity DataIC50:  1.80E+3nM. Assay description: Antagonist activity at Agrobacterium tumefaciens WCF47 TraR receptor assessed as inhibition of OOHL-induced response by beta-galctosidase reporter ge...
In DepthDetails ArticlePubMed