BDBM50269185 CHEMBL4069788
SMILES CC(C)C[C@H](NC(=O)[C@H](CC(N)=O)NC(=O)[C@H](CC1CCCCC1)NC(=O)[C@H](CC1CCCCC1)NC(=O)[C@H](Cc1ccncc1)NC(=O)[C@H](CCCNC(N)=N)NC(=O)[C@H]1CCCN1C(=O)[C@H](CO)NC(C)=O)C(=O)NC(C)(C)C(=O)N[C@@H]([C@@H](C)O)C(=O)N[C@@H](CCCNC(N)=N)C(=O)N[C@@H](CCC(N)=O)C(=O)N[C@@H](CCCNC(N)=N)C(=O)N[C@@H](CC1CCCCC1)C(N)=O
InChI Key InChIKey=DDQGRQBTSMKNEA-ZBJIVTJNSA-N
Data  1 IC50  1 EC50
  Tab Delimited (TSV)   2D SDfile   Computed 3D by Vconf -m prep SDfile
Find this compound or compounds like it in BindingDB:
Activity Spreadsheet -- Enzyme Inhibition Constant Data from BindingDB
Found 2 hits for monomerid = 50269185
TargetNeuropeptide Y receptor type 2(Homo sapiens (Human))
Takeda Pharmaceutical
Curated by ChEMBL
LigandPNGBDBM50269185(CHEMBL4069788)
Affinity DataIC50:  0.490nM. Assay description: Displacement of [125I]peptide YY from human Y2 receptor expressed in CHO cell membranes after 60 mins by TopCount scintillation counting analysis
In DepthDetails ArticlePubMed
TargetNeuropeptide Y receptor type 2(Homo sapiens (Human))
Takeda Pharmaceutical
Curated by ChEMBL
LigandPNGBDBM50269185(CHEMBL4069788)
Affinity DataEC50:  0.190nM. Assay description: Agonist activity at human Y2 receptor expressed in CHO cell membranes after 120 mins by [35S]GTPgammaS binding assay
In DepthDetails ArticlePubMed