BDBM50269394 CHEMBL4095789
SMILES Nc1nc(Nc2ccc(cc2)N2CCN(CC2)C2CC3CCC2C3)nn1-c1ncnc2ccc(F)cc12
InChI Key InChIKey=FJOGCOQDUBZENL-UHFFFAOYSA-N
Data  1 IC50  2 EC50
  Tab Delimited (TSV)   2D SDfile   Computed 3D by Vconf -m prep SDfile
Find this compound or compounds like it in BindingDB:
Activity Spreadsheet -- Enzyme Inhibition Constant Data from BindingDB
Found 3 hits for monomerid = 50269394
TargetVascular endothelial growth factor receptor 2(Homo sapiens (Human))
Rigel Pharmaceuticals
Curated by ChEMBL
LigandPNGBDBM50269394(CHEMBL4095789)
Affinity DataEC50:  146nM. Assay description: Inhibition of VEGF stimulated VEGFR2 phosphorylation at Y165 residues in HUVEC preincubated for 1 hr followed by VEGF addition measured after 5 mins ...
In DepthDetails ArticlePubMed
TargetTyrosine-protein kinase receptor UFO(Homo sapiens (Human))
Rigel Pharmaceuticals
Curated by ChEMBL
LigandPNGBDBM50269394(CHEMBL4095789)
Affinity DataIC50:  10nM. Assay description: Inhibition of N-terminal GST-tagged human Axl (464 to 885 end residues) cytoplasmic domain expressed in baculovirus expression system using HS1 pepti...
In DepthDetails ArticlePubMed
TargetTyrosine-protein kinase receptor UFO(Homo sapiens (Human))
Rigel Pharmaceuticals
Curated by ChEMBL
LigandPNGBDBM50269394(CHEMBL4095789)
Affinity DataEC50:  253nM. Assay description: Inhibition of Axl in human HeLa cells assessed as reduction in AKT phosphorylation at Ser 473 residues pre-incubated for 1 hr before preclustered ant...
In DepthDetails ArticlePubMed