BDBM50271037 4-[(4Z)-4-({[4-(4-Methylpiperazin-1-yl)phenyl]amino}methylene)-1,3-dioxo-1,2,3,4-tetra-hydroisoquinolin-6-yl]benzaldehyde::CHEMBL487531
SMILES CN1CCN(CC1)c1ccc(NC=C2C(=O)NC(=O)c3ccc(cc23)-c2ccc(C=O)cc2)cc1
InChI Key InChIKey=VJTNEPSXEDHFKQ-UHFFFAOYSA-N
Data  3 IC50
  Tab Delimited (TSV)   2D SDfile   Computed 3D by Vconf -m prep SDfile
Find this compound or compounds like it in BindingDB:
Activity Spreadsheet -- Enzyme Inhibition Constant Data from BindingDB
Found 3 hits for monomerid = 50271037
TargetCyclin-dependent kinase 1(Homo sapiens (Human))
Wyeth Research
Curated by ChEMBL
LigandPNGBDBM50271037(4-[(4Z)-4-({[4-(4-Methylpiperazin-1-yl)phenyl]amin...)
Affinity DataIC50:  8.20E+3nM. Assay description: Inhibition of CDK1/Cyclin B1 (unknown origin) expressed in Sf9 cells-baculovirus system assessed as retinoblastoma susceptibility gene product phosph...
In DepthDetails ArticlePubMed
TargetCyclin-dependent kinase 2(Homo sapiens (Human))
Wyeth Research
Curated by ChEMBL
LigandPNGBDBM50271037(4-[(4Z)-4-({[4-(4-Methylpiperazin-1-yl)phenyl]amin...)
Affinity DataIC50:  7.70E+3nM. Assay description: Inhibition of CDK2/cyclin E (unknown origin) expressed in Sf9 cells-baculovirus system assessed as retinoblastoma susceptibility gene product phospho...
In DepthDetails ArticlePubMed
TargetCyclin-dependent kinase 4(Homo sapiens (Human))
Wyeth Research
Curated by ChEMBL
LigandPNGBDBM50271037(4-[(4Z)-4-({[4-(4-Methylpiperazin-1-yl)phenyl]amin...)
Affinity DataIC50:  130nM. Assay description: Inhibition of CDK4/cyclin D1 (unknown origin) expressed in Sf9 cells-baculovirus system assessed as retinoblastoma susceptibility gene product phosph...
In DepthDetails ArticlePubMed