BDBM50271117 (4Z)-6-Piperidin-1-yl-4-({[4-(piperidin-1-ylmethyl)phenyl]-amino}methylene)isoquinoline-1,3(2H,4H)-dione::CHEMBL488549
SMILES O=C1NC(=O)c2ccc(cc2C1=CNc1ccc(CN2CCCCC2)cc1)N1CCCCC1
InChI Key InChIKey=PMEOKSYZMPMMJT-UHFFFAOYSA-N
Data  3 IC50
  Tab Delimited (TSV)   2D SDfile   Computed 3D by Vconf -m prep SDfile
Find this compound or compounds like it in BindingDB:
Activity Spreadsheet -- Enzyme Inhibition Constant Data from BindingDB
Found 3 hits for monomerid = 50271117
TargetCyclin-dependent kinase 2(Homo sapiens (Human))
Wyeth Research
Curated by ChEMBL
LigandPNGBDBM50271117((4Z)-6-Piperidin-1-yl-4-({[4-(piperidin-1-ylmethyl...)
Affinity DataIC50: >5.00E+4nM. Assay description: Inhibition of CDK2/cyclin E (unknown origin) expressed in Sf9 cells-baculovirus system assessed as retinoblastoma susceptibility gene product phospho...
In DepthDetails ArticlePubMed
TargetCyclin-dependent kinase 1(Homo sapiens (Human))
Wyeth Research
Curated by ChEMBL
LigandPNGBDBM50271117((4Z)-6-Piperidin-1-yl-4-({[4-(piperidin-1-ylmethyl...)
Affinity DataIC50: >5.00E+4nM. Assay description: Inhibition of CDK1/Cyclin B1 (unknown origin) expressed in Sf9 cells-baculovirus system assessed as retinoblastoma susceptibility gene product phosph...
In DepthDetails ArticlePubMed
TargetCyclin-dependent kinase 4(Homo sapiens (Human))
Wyeth Research
Curated by ChEMBL
LigandPNGBDBM50271117((4Z)-6-Piperidin-1-yl-4-({[4-(piperidin-1-ylmethyl...)
Affinity DataIC50:  1.00E+3nM. Assay description: Inhibition of CDK4/cyclin D1 (unknown origin) expressed in Sf9 cells-baculovirus system assessed as retinoblastoma susceptibility gene product phosph...
In DepthDetails ArticlePubMed