BDBM50271838 CHEMBL4127551
SMILES Cc1ccc(\C=C2/SC(=S)N(CC(O)=O)C2=O)cc1
InChI Key InChIKey=YSXOSCYMSSJZRP-POHAHGRESA-N
Data  1 IC50
PDB links: 6 PDB IDs match this monomer.
  Tab Delimited (TSV)   2D SDfile   Computed 3D by Vconf -m prep SDfile
Find this compound or compounds like it in BindingDB:
Activity Spreadsheet -- Enzyme Inhibition Constant Data from BindingDB
Found 1 hit for monomerid = 50271838
TargetMetallo-beta-lactamase type 2(Bacillus cereus)
University Of Oxford
Curated by ChEMBL
LigandPNGBDBM50271838(CHEMBL4127551)
Affinity DataIC50: >5.00E+4nM. Assay description: Inhibition of recombinant Bacillus cereus BC2 expressed in Escherichia coli BL21 (DE3) cells using FC4-FC5 as substrate by fluorescence-based assay
In DepthDetails ArticlePubMed