BDBM50273354 CHEMBL525755
SMILES CCCCCCCCCCCCCCCC(=O)NCCCC[C@H](NC(=O)[C@H](CCCCN)NC(=O)[C@H](CCCCN)NC(=O)[C@H](CCCCN)NC(=O)[C@@H]1CCCN1C(=O)CNC(=O)[C@H](CC(C)C)NC(=O)[C@H](CC(C)C)NC(=O)[C@H](Cc1ccc(O)cc1)NC(=O)CNC(=O)[C@H](C)NC(=O)[C@H](CO)NC(=O)[C@H](CC(N)=O)NC(=O)[C@H](CC(C)C)NC(=O)[C@@H](NC(=O)[C@H](Cc1c[nH]c2ccccc12)NC(=O)CNC)[C@@H](C)O)C(N)=O
InChI Key InChIKey=MRYZRGDKKJFCGR-CMDPNKGGSA-N
Data  2 KI
  Tab Delimited (TSV)   2D SDfile   Computed 3D by Vconf -m prep SDfile
Find this compound or compounds like it in BindingDB:
Activity Spreadsheet -- Enzyme Inhibition Constant Data from BindingDB
Found 2 hits for monomerid = 50273354
TargetGalanin receptor type 1(Homo sapiens (Human))
University Of Utah
Curated by ChEMBL
LigandPNGBDBM50273354(CHEMBL525755)
Affinity DataKi:  1.90nM. Assay description: Displacement of europium-labeled galanin from human GalR1 expressed in HEK293 EBNA cells
In DepthDetails ArticlePubMed
TargetGalanin receptor type 2(Homo sapiens (Human))
University Of Utah
Curated by ChEMBL
LigandPNGBDBM50273354(CHEMBL525755)
Affinity DataKi:  22nM. Assay description: Displacement of europium-labeled galanin from human GalR2 expressed in CHO-K1 cells
In DepthDetails ArticlePubMed