BDBM50273465 (+/-)-trans-1-Propyl-1,2,3,4,4a,5,10,10a-octahydrobenzo[g]quinolin-6-ol::CHEMBL3098131::CHEMBL455497
SMILES CCCN1CCC[C@@H]2Cc3c(O)cccc3C[C@@H]12
InChI Key InChIKey=GNIVTAIHBFVOJN-UKRRQHHQSA-N
Data  2 KI  1 EC50
  Tab Delimited (TSV)   2D SDfile   Computed 3D by Vconf -m prep SDfile
Find this compound or compounds like it in BindingDB:
Activity Spreadsheet -- Enzyme Inhibition Constant Data from BindingDB
Found 3 hits for monomerid = 50273465
TargetD(3) dopamine receptor(Rattus norvegicus (Rat))
Wayne State University
Curated by ChEMBL
LigandPNGBDBM50273465((+/-)-trans-1-Propyl-1,2,3,4,4a,5,10,10a-octahydro...)
Affinity DataKi:  395nM. Assay description: Displacement of [3H]Spiperone from rat dopamine D3 receptor expressed in HEK293 cells
In DepthDetails ArticlePubMed
TargetD(2) dopamine receptor(Rattus norvegicus (rat))
Wayne State University
Curated by ChEMBL
LigandPNGBDBM50273465((+/-)-trans-1-Propyl-1,2,3,4,4a,5,10,10a-octahydro...)
Affinity DataKi:  2.78E+3nM. Assay description: Displacement of [3H]Spiperone from rat dopamine D2L receptor expressed in HEK293 cells
In DepthDetails ArticlePubMed
TargetD(2) dopamine receptor(Homo sapiens (Human))
University Of Copenhagen
Curated by ChEMBL
LigandPNGBDBM50273465((+/-)-trans-1-Propyl-1,2,3,4,4a,5,10,10a-octahydro...)
Affinity DataEC50:  0.170nM. Assay description: Agonist activity at human dopamine D2 receptor expressed in CHO cells assessed as increase of forskolin-induced cAMP production after 20 mins
In DepthDetails ArticlePubMed