BDBM50273951 CHEMBL4126165
SMILES Cc1cc(CNC(=O)c2nc3n(CCCC33CCCC3)c(=O)c2O)ccc1F
InChI Key InChIKey=GOXOIUKALCKLBR-UHFFFAOYSA-N
Data  1 IC50  2 EC50
  Tab Delimited (TSV)   2D SDfile   Computed 3D by Vconf -m prep SDfile
Find this compound or compounds like it in BindingDB:
Activity Spreadsheet -- Enzyme Inhibition Constant Data from BindingDB
Found 3 hits for monomerid = 50273951
TargetIntegrase(Human immunodeficiency virus 1)
Bristol-Myers Squibb Research And Development
Curated by ChEMBL
LigandPNGBDBM50273951(CHEMBL4126165)
Affinity DataEC50:  5nM. Assay description: Inhibition of HIV-1 integrase strand transfer activity assessed as reduction in viral replication in presence of 10% fetal bovine serum
Ligand InfoPC cidPC sid
In DepthDetails ArticlePubMed
TargetIntegrase(Human immunodeficiency virus 1)
Bristol-Myers Squibb Research And Development
Curated by ChEMBL
LigandPNGBDBM50273951(CHEMBL4126165)
Affinity DataIC50:  2nM. Assay description: Inhibition of HIV1 integrase strand transfer activity
Ligand InfoPC cidPC sid
In DepthDetails ArticlePubMed
TargetIntegrase(Human immunodeficiency virus 1)
Bristol-Myers Squibb Research And Development
Curated by ChEMBL
LigandPNGBDBM50273951(CHEMBL4126165)
Affinity DataEC50:  149nM. Assay description: Inhibition of HIV-1 integrase strand transfer activity assessed as reduction in viral replication in presence of 10% fetal bovine serum and 10% human...
Ligand InfoPC cidPC sid
In DepthDetails ArticlePubMed