BDBM50275437 CHEMBL4129620
SMILES O=C(N([C@@H]1CCCNC1)c1nccc2ccccc12)c1ccc(cc1)-c1ccccc1
InChI Key InChIKey=SJRIWRFBPGSPPK-XMMPIXPASA-N
Data  2 KI
  Tab Delimited (TSV)   2D SDfile   Computed 3D by Vconf -m prep SDfile
Find this compound or compounds like it in BindingDB:
Activity Spreadsheet -- Enzyme Inhibition Constant Data from BindingDB
Found 2 hits for monomerid = 50275437
TargetPotassium voltage-gated channel subfamily H member 2(Homo sapiens (Human))
Pfizer
Curated by ChEMBL
LigandPNGBDBM50275437(CHEMBL4129620)
Affinity DataKi:  2.20E+3nM. Assay description: Binding affinity to human ERG by dofetilide fluorescence polarization binding assay
In DepthDetails ArticlePubMed
TargetPotassium voltage-gated channel subfamily H member 2(Homo sapiens (Human))
Pfizer
Curated by ChEMBL
LigandPNGBDBM50275437(CHEMBL4129620)
Affinity DataKi:  2.20E+3nM. Assay description: Inhibition of dofetilide binding to human ERG by fluorescence polarization assay
In DepthDetails ArticlePubMed