BDBM50276040 3'-[1-(4-ethoxycarbonylpiperdinyl)]-3'-deoxy-ara-uridine::CHEMBL471836
SMILES CCOC(=O)C1CCN(CC1)[C@@H]1[C@@H](CO)O[C@H]([C@H]1O)n1ccc(=O)[nH]c1=O
InChI Key InChIKey=KPIYJVNMUBHXLH-REBRKWNGSA-N
Data  1 KI
  Tab Delimited (TSV)   2D SDfile   Computed 3D by Vconf -m prep SDfile
Find this compound or compounds like it in BindingDB:
Activity Spreadsheet -- Enzyme Inhibition Constant Data from BindingDB
Found 1 hit for monomerid = 50276040
TargetRibonuclease pancreatic(Homo sapiens (Human))
Institute Of Technology
Curated by ChEMBL
LigandPNGBDBM50276040(3'-[1-(4-ethoxycarbonylpiperdinyl)]-3'-deoxy-ara-u...)
Affinity DataKi:  1.20E+5nM. Assay description: Inhibition of ribonucleolytic activity of RNase A (unknown origin) by agarose gel based assay
In DepthDetails ArticlePubMed