BDBM50277631 2-(1-isopropyl-9-(2,4,5-trichlorophenylthio)-7,8-dihydro-6H-pyrido[3,4-b]pyrrolizin-8-yl)acetic acid::CHEMBL520007
SMILES CC(C)c1nccc2n3CCC(CC(O)=O)c3c(Sc3cc(Cl)c(Cl)cc3Cl)c12
InChI Key InChIKey=VONICINKTYRBRJ-UHFFFAOYSA-N
Data  2 KI
  Tab Delimited (TSV)   2D SDfile   Computed 3D by Vconf -m prep SDfile
Find this compound or compounds like it in BindingDB:
Activity Spreadsheet -- Enzyme Inhibition Constant Data from BindingDB
Found 2 hits for monomerid = 50277631
TargetProstaglandin D2 receptor(Homo sapiens (Human))
Merck Frosst Centre For Therapeutic Research
Curated by ChEMBL
LigandPNGBDBM50277631(2-(1-isopropyl-9-(2,4,5-trichlorophenylthio)-7,8-d...)
Affinity DataKi:  0.390nM. Assay description: Displacement of radioligand from human recombinant DP1 receptor expressed in HEK293 cells by scintillation proximity assay
In DepthDetails ArticlePubMed
TargetThromboxane A2 receptor(Homo sapiens (Human))
Merck Frosst Centre For Therapeutic Research
Curated by ChEMBL
LigandPNGBDBM50277631(2-(1-isopropyl-9-(2,4,5-trichlorophenylthio)-7,8-d...)
Affinity DataKi:  186nM. Assay description: Displacement of radioligand from human recombinant TP receptor expressed in HEK293 cells by scintillation proximity assay
In DepthDetails ArticlePubMed