BDBM50281004 CHEMBL419820::[(5R,6S)-6-((R)-1-Hydroxy-ethyl)-7-oxo-2-thia-1-aza-bicyclo[3.2.0]hept-(3E)-ylidene]-acetic acid tert-butyl ester
SMILES C[C@@H](O)[C@@H]1[C@H]2C\C(SN2C1=O)=C/C(=O)OC(C)(C)C
InChI Key InChIKey=NKCXCBJRIHHHST-LFYAHWRRSA-N
Data  1 KI  1 Koff  2 Kon
  Tab Delimited (TSV)   2D SDfile   Computed 3D by Vconf -m prep SDfile
Find this compound or compounds like it in BindingDB:
Activity Spreadsheet -- Enzyme Inhibition Constant Data from BindingDB
Found 3 hits for monomerid = 50281004
TargetNeutrophil elastase(Homo sapiens (Human))
TBA
Curated by ChEMBL
LigandPNGBDBM50281004(CHEMBL419820 | [(5R,6S)-6-((R)-1-Hydroxy-ethyl)-7-...)
Affinity DataKi:  3.20E+3nM Koff:  130s-1Assay Description:Rate constant for the compound was determined (k2/ki) against human leukocyte elastase (HLE)
In DepthDetails Article
TargetNeutrophil elastase(Homo sapiens (Human))
TBA
Curated by ChEMBL
LigandPNGBDBM50281004(CHEMBL419820 | [(5R,6S)-6-((R)-1-Hydroxy-ethyl)-7-...)
Affinity DataKon:  0.000400M-1s-1Assay Description:Rate constant for the compound was determined against human leukocyte elastase (HLE)
In DepthDetails Article
TargetNeutrophil elastase(Homo sapiens (Human))
TBA
Curated by ChEMBL
LigandPNGBDBM50281004(CHEMBL419820 | [(5R,6S)-6-((R)-1-Hydroxy-ethyl)-7-...)
Affinity DataKoff:  130s-1Assay Description:Rate constant for the compound was determined (k2/ki) against human leukocyte elastase (HLE)
In DepthDetails Article