BDBM50282017 (trans)-3-{3-[5-(4-Fluoro-phenyl)-tetrahydro-furan-2-yloxy]-propyl}-pyridine::CHEMBL37364
SMILES Fc1ccc(cc1)[C@@H]1CC[C@@H](OCCCc2cccnc2)O1
InChI Key InChIKey=JGZAPNNTDFCIHI-ROUUACIJSA-N
Data  1 IC50
  Tab Delimited (TSV)   2D SDfile   Computed 3D by Vconf -m prep SDfile
Find this compound or compounds like it in BindingDB:
Activity Spreadsheet -- Enzyme Inhibition Constant Data from BindingDB
Found 1 hit for monomerid = 50282017
TargetPlatelet-activating factor receptor(Homo sapiens (Human))
TBA
Curated by ChEMBL
LigandPNGBDBM50282017((trans)-3-{3-[5-(4-Fluoro-phenyl)-tetrahydro-furan...)
Affinity DataIC50:  4.00E+3nM. Assay description: In vitro inhibition of [3H]PAF receptor binding to washed human platelet membranes
In DepthDetails Article