BDBM50282021 1-[6-(5-Hexyl-tetrahydro-furan-2-yloxy)-hexyl]-pyridinium; chloride::CHEMBL36733
SMILES CCCCCCC1CCC(OCCCCCC[n+]2ccccc2)O1
InChI Key InChIKey=PLOBJHMUEHCYHY-UHFFFAOYSA-N
Data  1 IC50
  Tab Delimited (TSV)   2D SDfile   Computed 3D by Vconf -m prep SDfile
Find this compound or compounds like it in BindingDB:
Activity Spreadsheet -- Enzyme Inhibition Constant Data from BindingDB
Found 1 hit for monomerid = 50282021
TargetPlatelet-activating factor receptor(Homo sapiens (Human))
TBA
Curated by ChEMBL
LigandPNGBDBM50282021(1-[6-(5-Hexyl-tetrahydro-furan-2-yloxy)-hexyl]-pyr...)
Affinity DataIC50:  1.60E+3nM. Assay description: In vitro inhibition of [3H]PAF receptor binding to washed human platelet membranes
In DepthDetails Article