BDBM50282023 3-{3-[(2S,5S)-5-(3,4-Dimethoxy-phenyl)-tetrahydro-furan-2-yloxy]-propyl}-1-methyl-pyridinium; iodide::CHEMBL34063
SMILES COc1ccc(cc1OC)[C@@H]1CC[C@@H](OCCCc2ccc[n+](C)c2)O1
InChI Key InChIKey=YXLADDLCAWAQGT-RXVVDRJESA-N
Data  1 IC50
  Tab Delimited (TSV)   2D SDfile   Computed 3D by Vconf -m prep SDfile
Find this compound or compounds like it in BindingDB:
Activity Spreadsheet -- Enzyme Inhibition Constant Data from BindingDB
Found 1 hit for monomerid = 50282023
TargetPlatelet-activating factor receptor(Homo sapiens (Human))
TBA
Curated by ChEMBL
LigandPNGBDBM50282023(3-{3-[(2S,5S)-5-(3,4-Dimethoxy-phenyl)-tetrahydro-...)
Affinity DataIC50:  3.00E+3nM. Assay description: In vitro inhibition of [3H]PAF receptor binding to washed human platelet membranes
In DepthDetails Article