BDBM50284736 3-Allyloxycarbonylamino-5-(2-carbamoyl-naphthalen-1-yloxy)-4-oxo-pentanoic acid::CHEMBL280979
SMILES NC(=O)c1ccc2ccccc2c1OCC(=O)C(CC(O)=O)NC(=O)OCC=C
InChI Key InChIKey=WRELNNOINOLNAF-UHFFFAOYSA-N
Data  1 KI
  Tab Delimited (TSV)   2D SDfile   Computed 3D by Vconf -m prep SDfile
Find this compound or compounds like it in BindingDB:
Activity Spreadsheet -- Enzyme Inhibition Constant Data from BindingDB
Found 1 hit for monomerid = 50284736
TargetCaspase-1(Homo sapiens (Human))
TBA
Curated by ChEMBL
LigandPNGBDBM50284736(3-Allyloxycarbonylamino-5-(2-carbamoyl-naphthalen-...)
Affinity DataKi: >2.20E+4nM. Assay description: Inhibition of IL-1 beta converting enzyme (ICE) in human blood monocytes expressed as Kon
In DepthDetails Article