BDBM50284739 3-[2-(2-Benzyloxycarbonylamino-3-methyl-butyrylamino)-propionylamino]-4-oxo-5-phenoxy-pentanoic acid::CHEMBL30626::CHEMBL3143889
SMILES CC(C)[C@H](NC(=O)OCc1ccccc1)C(=O)N[C@@H](C)C(=O)N[C@@H](CC(O)=O)C(=O)COc1ccccc1
InChI Key InChIKey=GQSSECURHCUEBG-UHFFFAOYSA-N
Data  1 KI  1 Kon
  Tab Delimited (TSV)   2D SDfile   Computed 3D by Vconf -m prep SDfile
Find this compound or compounds like it in BindingDB:
Activity Spreadsheet -- Enzyme Inhibition Constant Data from BindingDB
Found 1 hit for monomerid = 50284739
TargetCaspase-1(Homo sapiens (Human))
TBA
Curated by ChEMBL
LigandPNGBDBM50284739(3-[2-(2-Benzyloxycarbonylamino-3-methyl-butyrylami...)
Affinity DataKi:  4.90E+3nM. Assay description: Inhibition of IL-1 beta converting enzyme (ICE) in human blood monocytes expressed as Kon
In DepthDetails Article