BDBM50284748 3-Allyloxycarbonylamino-5-(2-carbamoyl-phenoxy)-4-oxo-pentanoic acid::CHEMBL30902
SMILES NC(=O)c1ccccc1OCC(=O)C(CC(O)=O)NC(=O)OCC=C
InChI Key InChIKey=CDPUNQJLRZYZFA-UHFFFAOYSA-N
Data  1 KI
  Tab Delimited (TSV)   2D SDfile   Computed 3D by Vconf -m prep SDfile
Find this compound or compounds like it in BindingDB:
Activity Spreadsheet -- Enzyme Inhibition Constant Data from BindingDB
Found 1 hit for monomerid = 50284748
TargetCaspase-1(Homo sapiens (Human))
TBA
Curated by ChEMBL
LigandPNGBDBM50284748(3-Allyloxycarbonylamino-5-(2-carbamoyl-phenoxy)-4-...)
Affinity DataKi:  3.80E+3nM. Assay description: Inhibition of IL-1 beta converting enzyme (ICE) in human blood monocytes expressed as Kon
In DepthDetails Article