BDBM50284898 CHEMBL42410::[1-((R)-3-[2-(1-Hydroxy-1-methyl-ethyl)-phenyl]-1-{3-[(E)-2-(6-methoxy-benzothiazol-2-yl)-vinyl]-phenyl}-propylsulfanylmethyl)-cyclopropyl]-acetic acid
SMILES COc1ccc2nc(\C=C\c3cccc(c3)[C@@H](CCc3ccccc3C(C)(C)O)SCC3(CC(O)=O)CC3)sc2c1
InChI Key InChIKey=DRZSYKAOSUWODQ-KPHCWXNXSA-N
Data  1 IC50
  Tab Delimited (TSV)   2D SDfile   Computed 3D by Vconf -m prep SDfile
Find this compound or compounds like it in BindingDB:
Activity Spreadsheet -- Enzyme Inhibition Constant Data from BindingDB
Found 1 hit for monomerid = 50284898
TargetCysteinyl leukotriene receptor 1(GUINEA PIG)
TBA
Curated by ChEMBL
LigandPNGBDBM50284898(CHEMBL42410 | [1-((R)-3-[2-(1-Hydroxy-1-methyl-eth...)
Affinity DataIC50:  48nM. Assay description: Inhibition of [3H]-LTD4 binding on guinea-pig lung membranes
In DepthDetails Article