BDBM50285677 (1-{(R)-1-{3-[(E)-2-(2,3-Dichloro-thieno[3,2-b]pyridin-5-yl)-vinyl]-phenyl}-3-[3-(1-hydroxy-cyclobutyl)-phenyl]-propylsulfanylmethyl}-cyclopropyl)-acetic acid::CHEMBL313195
SMILES OC(=O)CC1(CS[C@H](CCc2cccc(c2)C2(O)CCC2)c2cccc(\C=C\c3ccc4sc(Cl)c(Cl)c4n3)c2)CC1
InChI Key InChIKey=KEGQUGIJAFPXHO-LNYWEAQCSA-N
Data  1 IC50
  Tab Delimited (TSV)   2D SDfile   Computed 3D by Vconf -m prep SDfile
Find this compound or compounds like it in BindingDB:
Activity Spreadsheet -- Enzyme Inhibition Constant Data from BindingDB
Found 1 hit for monomerid = 50285677
TargetCysteinyl leukotriene receptor 1(Homo sapiens (Human))
TBA
Curated by ChEMBL
LigandPNGBDBM50285677((1-{(R)-1-{3-[(E)-2-(2,3-Dichloro-thieno[3,2-b]pyr...)
Affinity DataIC50:  0.470nM. Assay description: Inhibition of binding of [ H]-LTD4 to DMSO differentiated U937 cell membranes
In DepthDetails Article