BDBM50286340 (R)-N*1*-[(S)-1-(4-Benzyloxy-butylcarbamoyl)-2-(1H-indol-3-yl)-ethyl]-N*4*-hydroxy-2-isobutyl-succinamide::CHEMBL114094
SMILES CC(C)C[C@H](CC(=O)NO)C(=O)N[C@@H](Cc1c[nH]c2ccccc12)C(=O)NCCCCOCc1ccccc1
InChI Key InChIKey=ZICWKULKLWQFSX-KCWPFWIISA-N
Data  1 KI
  Tab Delimited (TSV)   2D SDfile   Computed 3D by Vconf -m prep SDfile
Find this compound or compounds like it in BindingDB:
Activity Spreadsheet -- Enzyme Inhibition Constant Data from BindingDB
Found 1 hit for monomerid = 50286340
TargetInterstitial collagenase(Homo sapiens (Human))
TBA
Curated by ChEMBL
LigandPNGBDBM50286340((R)-N*1*-[(S)-1-(4-Benzyloxy-butylcarbamoyl)-2-(1H...)
Affinity DataKi:  2nM. Assay description: Evaluated for inhibitory activity against Human fidroblast collagenase (HFC)
In DepthDetails Article