BDBM50286775 CHEMBL4174152
SMILES CC(C)C[C@H](N)C(=O)NS(=O)(=O)c1cccc(c1)-c1cc(nc(N)n1)-c1ccccc1
InChI Key InChIKey=FDKDOHYGEOEKBT-SFHVURJKSA-N
Data  3 IC50  1 Kd
  Tab Delimited (TSV)   2D SDfile   Computed 3D by Vconf -m prep SDfile
Find this compound or compounds like it in BindingDB:
Activity Spreadsheet -- Enzyme Inhibition Constant Data from BindingDB
Found 4 hits for monomerid = 50286775
TargetLeucine--tRNA ligase, cytoplasmic(Homo sapiens (Human))
Oxford Drug Design
Curated by ChEMBL
LigandPNGBDBM50286775(CHEMBL4174152)
Affinity DataIC50:  33nM. Assay description: Inhibition of human LeuRS assessed as reduction in ATP consumption
In DepthDetails ArticlePubMed
TargetLeucine--tRNA ligase(Escherichia coli (strain K12))
Oxford Drug Design
Curated by ChEMBL
LigandPNGBDBM50286775(CHEMBL4174152)
Affinity DataKd:  56nM. Assay description: Displacement of IK-698 from Escherichia coli LeuRS by isothermal titration calorimetric calorimetry
In DepthDetails ArticlePubMed
TargetLeucine--tRNA ligase(Escherichia coli (strain K12))
Oxford Drug Design
Curated by ChEMBL
LigandPNGBDBM50286775(CHEMBL4174152)
Affinity DataIC50:  224nM. Assay description: Inhibition of Escherichia coli LeuRS expressed in Escherichia coli M15 cells assessed as reduction in ATP consumption
In DepthDetails ArticlePubMed
TargetLeucine--tRNA ligase(Staphylococcus aureus (strain NCTC 8325))
Oxford Drug Design
Curated by ChEMBL
LigandPNGBDBM50286775(CHEMBL4174152)
Affinity DataIC50:  3.60E+3nM. Assay description: Inhibition of Staphylococcus aureus LeuRS expressed in Escherichia coli M15 cells assessed as reduction in ATP consumption
In DepthDetails ArticlePubMed