BDBM50287230 6-Oxo-6-[4-(3-piperidin-4-yl-propyl)-piperidin-1-yl]-hexanoic acid::CHEMBL31182
SMILES OC(=O)CCCCC(=O)N1CCC(CCCC2CCNCC2)CC1
InChI Key InChIKey=NEPCPAUSYSQUDG-UHFFFAOYSA-N
Data  1 IC50
  Tab Delimited (TSV)   2D SDfile   Computed 3D by Vconf -m prep SDfile
Find this compound or compounds like it in BindingDB:
Activity Spreadsheet -- Enzyme Inhibition Constant Data from BindingDB
Found 1 hit for monomerid = 50287230
TargetIntegrin alpha-IIb/beta-3(Homo sapiens (Human))
TBA
Curated by ChEMBL
LigandPNGBDBM50287230(6-Oxo-6-[4-(3-piperidin-4-yl-propyl)-piperidin-1-y...)
Affinity DataIC50:  6.70E+3nM. Assay description: Inhibition of [125I]- Fg binding to fibrinogen receptor of activated human platelets
In DepthDetails Article