BDBM50287523 6-Benzenesulfonyl-8-methyl-5-nitro-quinoline::CHEMBL300204
SMILES Cc1cc(c([N+]([O-])=O)c2cccnc12)S(=O)(=O)c1ccccc1
InChI Key InChIKey=LFHMFQYIJWABDY-UHFFFAOYSA-N
Data  1 KI
  Tab Delimited (TSV)   2D SDfile   Computed 3D by Vconf -m prep SDfile
Find this compound or compounds like it in BindingDB:
Activity Spreadsheet -- Enzyme Inhibition Constant Data from BindingDB
Found 1 hit for monomerid = 50287523
TargetNeuropeptide Y receptor type 1(Homo sapiens (Human))
TBA
Curated by ChEMBL
LigandPNGBDBM50287523(6-Benzenesulfonyl-8-methyl-5-nitro-quinoline | CHE...)
Affinity DataKi: >1.00E+4nM. Assay description: Compound was tested for binding affinity against neuropeptide Y1 (NPY1) receptor from SK-N-MC membranes using [125I]-PYY as radioligand
In DepthDetails Article