BDBM50287534 6-(2-Bromo-benzenesulfonyl)-5-nitro-quinolin-8-ylamine::CHEMBL53497
SMILES Nc1cc(c([N+]([O-])=O)c2cccnc12)S(=O)(=O)c1ccccc1Br
InChI Key InChIKey=ZSOSHFABBNJQDE-UHFFFAOYSA-N
Data  1 KI
  Tab Delimited (TSV)   2D SDfile   Computed 3D by Vconf -m prep SDfile
Find this compound or compounds like it in BindingDB:
Activity Spreadsheet -- Enzyme Inhibition Constant Data from BindingDB
Found 1 hit for monomerid = 50287534
TargetNeuropeptide Y receptor type 1(Homo sapiens (Human))
TBA
Curated by ChEMBL
LigandPNGBDBM50287534(6-(2-Bromo-benzenesulfonyl)-5-nitro-quinolin-8-yla...)
Affinity DataKi:  234nM. Assay description: Compound was tested for binding affinity against neuropeptide Y1 (NPY1) receptor from SK-N-MC membranes using [125I]-PYY as radioligand
In DepthDetails Article