BDBM50288374 CHEMBL4169982
SMILES Cc1cnc(Nc2cc(cc(c2)S(C)(=O)=O)N2CCOCC2)nc1Nc1cccc(CO)c1
InChI Key InChIKey=ZYUIOHBKRDLONG-UHFFFAOYSA-N
Data  3 IC50
  Tab Delimited (TSV)   2D SDfile   Computed 3D by Vconf -m prep SDfile
Find this compound or compounds like it in BindingDB:
Activity Spreadsheet -- Enzyme Inhibition Constant Data from BindingDB
Found 3 hits for monomerid = 50288374
TargetTyrosine-protein kinase JAK2(Homo sapiens (Human))
Astrazeneca
Curated by ChEMBL
LigandPNGBDBM50288374(CHEMBL4169982)
Affinity DataIC50:  417nM. Assay description: Inhibition of recombinant human JAK2 (831 to 1132 residues) expressed in insect cells using 5FAM-GEEPLYWSFPAKKK-NH2 as substrate after 10 mins by cal...
In DepthDetails ArticlePubMed
TargetTyrosine-protein kinase JAK3(Homo sapiens (Human))
Astrazeneca
Curated by ChEMBL
LigandPNGBDBM50288374(CHEMBL4169982)
Affinity DataIC50: >3.00E+4nM. Assay description: Inhibition of recombinant human JAK3 (781 to 1124 residues) expressed in insect cells using 5FAM-GEEPLYWSFPAKKK-NH2 as substrate after 10 mins by cal...
In DepthDetails ArticlePubMed
TargetTyrosine-protein kinase JAK1(Homo sapiens (Human))
Astrazeneca
Curated by ChEMBL
LigandPNGBDBM50288374(CHEMBL4169982)
Affinity DataIC50:  13nM. Assay description: Inhibition of cytoplasmic recombinant human GST-tagged JAK1 (886 to 1154 residues) expressed in insect cells using FITC-C6-KKHTDDGYMPMSPGVA-NH as sub...
In DepthDetails ArticlePubMed