BDBM50288378 CHEMBL4162065
SMILES CN1CCN(CC1)c1cc(Nc2ncc(Br)c(Nc3cccc(CO)c3)n2)cc(c1)S(C)(=O)=O
InChI Key InChIKey=IBJYRIBNJVAHAE-UHFFFAOYSA-N
Data  3 IC50
  Tab Delimited (TSV)   2D SDfile   Computed 3D by Vconf -m prep SDfile
Find this compound or compounds like it in BindingDB:
Activity Spreadsheet -- Enzyme Inhibition Constant Data from BindingDB
Found 3 hits for monomerid = 50288378
TargetTyrosine-protein kinase JAK3(Homo sapiens (Human))
Astrazeneca
Curated by ChEMBL
LigandPNGBDBM50288378(CHEMBL4162065)
Affinity DataIC50:  6.54E+3nM. Assay description: Inhibition of recombinant human JAK3 (781 to 1124 residues) expressed in insect cells using 5FAM-GEEPLYWSFPAKKK-NH2 as substrate after 10 mins by cal...
In DepthDetails ArticlePubMed
TargetTyrosine-protein kinase JAK2(Homo sapiens (Human))
Astrazeneca
Curated by ChEMBL
LigandPNGBDBM50288378(CHEMBL4162065)
Affinity DataIC50:  363nM. Assay description: GRAC: human PDE2A selective inhibitor
In DepthDetails ArticlePubMed
TargetTyrosine-protein kinase JAK1(Homo sapiens (Human))
Astrazeneca
Curated by ChEMBL
LigandPNGBDBM50288378(CHEMBL4162065)
Affinity DataIC50: <3nM. Assay description: GRAC: human IMPase 1 inhibitor
In DepthDetails ArticlePubMed