BDBM50288514 CHEMBL4170235
SMILES CN1CCN(CC1)c1cc(Nc2nccc(Nc3cccc(CO)c3)n2)cc(c1)S(C)(=O)=O
InChI Key InChIKey=VVPCLGYIXOHVOF-UHFFFAOYSA-N
Data  2 IC50
  Tab Delimited (TSV)   2D SDfile   Computed 3D by Vconf -m prep SDfile
Find this compound or compounds like it in BindingDB:
Activity Spreadsheet -- Enzyme Inhibition Constant Data from BindingDB
Found 2 hits for monomerid = 50288514
TargetTyrosine-protein kinase JAK3(Homo sapiens (Human))
Astrazeneca
Curated by ChEMBL
LigandPNGBDBM50288514(CHEMBL4170235)
Affinity DataIC50: >3.00E+4nM. Assay description: Inhibition of recombinant human JAK3 (781 to 1124 residues) expressed in insect cells using 5FAM-GEEPLYWSFPAKKK-NH2 as substrate after 10 mins by cal...
In DepthDetails ArticlePubMed
TargetTyrosine-protein kinase JAK2(Homo sapiens (Human))
Astrazeneca
Curated by ChEMBL
LigandPNGBDBM50288514(CHEMBL4170235)
Affinity DataIC50:  1.39E+4nM. Assay description: Inhibition of recombinant human JAK2 (831 to 1132 residues) expressed in insect cells using 5FAM-GEEPLYWSFPAKKK-NH2 as substrate after 10 mins by cal...
In DepthDetails ArticlePubMed