BDBM50288866 3-Naphthalen-2-yl-2-[2-(4-sulfamoyl-benzoylamino)-acetylamino]-propionic acid::CHEMBL153214
SMILES NS(=O)(=O)c1ccc(cc1)C(=O)NCC(=O)NC(Cc1ccc2ccccc2c1)C(O)=O
InChI Key InChIKey=QJLZHMAMAALUCL-UHFFFAOYSA-N
Data  1 Kd
  Tab Delimited (TSV)   2D SDfile   Computed 3D by Vconf -m prep SDfile
Find this compound or compounds like it in BindingDB:
Activity Spreadsheet -- Enzyme Inhibition Constant Data from BindingDB
Found 1 hit for monomerid = 50288866
TargetCarbonic anhydrase 2(Homo sapiens (Human))
TBA
Curated by ChEMBL
LigandPNGBDBM50288866(3-Naphthalen-2-yl-2-[2-(4-sulfamoyl-benzoylamino)-...)
Affinity DataKd:  130nM. Assay description: Dissociation constant against human carbonic anhydrase II at 37 degree centigrade
In DepthDetails Article