BDBM50288883 5-Guanidino-2-{2-[2-(4-sulfamoyl-benzoylamino)-acetylamino]-acetylamino}-pentanoic acid::CHEMBL2371072
SMILES NC(=N)NCCC[C@H](NC(=O)CNC(=O)CNC(=O)CNC(=O)c1ccc(cc1)S(N)(=O)=O)C(O)=O
InChI Key InChIKey=GIZDXEMFHSLFAJ-ZDUSSCGKSA-N
Data  1 Kd
  Tab Delimited (TSV)   2D SDfile   Computed 3D by Vconf -m prep SDfile
Find this compound or compounds like it in BindingDB:
Activity Spreadsheet -- Enzyme Inhibition Constant Data from BindingDB
Found 1 hit for monomerid = 50288883
TargetCarbonic anhydrase 2(Homo sapiens (Human))
TBA
Curated by ChEMBL
LigandPNGBDBM50288883(5-Guanidino-2-{2-[2-(4-sulfamoyl-benzoylamino)-ace...)
Affinity DataKd:  290nM. Assay description: Dissociation constant against human carbonic anhydrase II at 37 degree centigrade
In DepthDetails Article