BDBM50289654 CHEMBL436894::Compound SRTX6b
SMILES CC[C@H](C)[C@H](NC(=O)[C@@H](NC(=O)[C@H](CC(O)=O)NC(=O)[C@H](CCC(N)=O)NC(=O)[C@H](Cc1cnc[nH]1)NC(=O)[C@H](CS)NC(=O)[C@H](Cc1ccccc1)NC(=O)[C@H](Cc1ccc(O)cc1)NC(=O)[C@@H](N)CC(C)C)C(C)C)C(=O)N[C@@H](Cc1c[nH]c2ccccc12)C(O)=O
InChI Key InChIKey=SFSIFZZQDRPMDO-CSJJGNFLSA-N
Data  1 IC50
  Tab Delimited (TSV)   2D SDfile   Computed 3D by Vconf -m prep SDfile
Find this compound or compounds like it in BindingDB:
Activity Spreadsheet -- Enzyme Inhibition Constant Data from BindingDB
Found 1 hit for monomerid = 50289654
TargetEndothelin receptor type B(Bos taurus)
TBA
Curated by ChEMBL
LigandPNGBDBM50289654(CHEMBL436894 | Compound SRTX6b)
Affinity DataIC50:  3.00E+3nM. Assay description: Binding activity to ET-B receptor on bovine cerebellum membrane
In DepthDetails Article