BDBM50290055 CHEMBL303428::Pyridin-2-yl-carbamic acid 2-[6-(4-tert-butyl-benzenesulfonylamino)-5-(2-methoxy-phenoxy)-2-propyl-pyrimidin-4-yloxy]-ethyl ester
SMILES CCCc1nc(NS(=O)(=O)c2ccc(cc2)C(C)(C)C)c(Oc2ccccc2OC)c(OCCOC(=O)Nc2ccccn2)n1
InChI Key InChIKey=ZYPQETRCACBJNS-UHFFFAOYSA-N
Data  2 IC50
  Tab Delimited (TSV)   2D SDfile   Computed 3D by Vconf -m prep SDfile
Find this compound or compounds like it in BindingDB:
Activity Spreadsheet -- Enzyme Inhibition Constant Data from BindingDB
Found 2 hits for monomerid = 50290055
TargetEndothelin receptor type B(Homo sapiens (Human))
TBA
Curated by ChEMBL
LigandPNGBDBM50290055(CHEMBL303428 | Pyridin-2-yl-carbamic acid 2-[6-(4-...)
Affinity DataIC50:  63nM. Assay description: Receptor binding affinity was determined against [125I]ET1 with membranes prepared from human placenta for ETB receptor
In DepthDetails Article
TargetEndothelin-1 receptor(Homo sapiens (Human))
TBA
Curated by ChEMBL
LigandPNGBDBM50290055(CHEMBL303428 | Pyridin-2-yl-carbamic acid 2-[6-(4-...)
Affinity DataIC50:  9nM. Assay description: Receptor binding affinity was determined against [125I]ET1 with recombinant human ETA receptor, expressed in baculovirus-infected Sf9 cells
In DepthDetails Article