BDBM50290212 CHEMBL80315::Thiophene-2-carboxylic acid (4-{2-[4-(2,3-dichloro-phenyl)-piperazin-1-yl]-ethyl}-cyclohexyl)-methyl-amide
SMILES CN([C@H]1CC[C@H](CCN2CCN(CC2)c2cccc(Cl)c2Cl)CC1)C(=O)c1cccs1
InChI Key InChIKey=JCGBUUHLRXHEQS-WGSAOQKQSA-N
Data  2 KI
  Tab Delimited (TSV)   2D SDfile   Computed 3D by Vconf -m prep SDfile
Find this compound or compounds like it in BindingDB:
Activity Spreadsheet -- Enzyme Inhibition Constant Data from BindingDB
Found 2 hits for monomerid = 50290212
TargetD(3) dopamine receptor(Homo sapiens (Human))
TBA
Curated by ChEMBL
LigandPNGBDBM50290212(CHEMBL80315 | Thiophene-2-carboxylic acid (4-{2-[4...)
Affinity DataKi:  4.20nM. Assay description: Ability to displace radioligand [3H]spiperone from human dopamine D3 receptor transfected chinese hamster ovary cell membranes.
In DepthDetails Article
TargetD(2) dopamine receptor(Homo sapiens (Human))
TBA
Curated by ChEMBL
LigandPNGBDBM50290212(CHEMBL80315 | Thiophene-2-carboxylic acid (4-{2-[4...)
Affinity DataKi:  17nM. Assay description: Ability to displace radioligand [3H]N-0437 from human dopamine D2 receptor transfected chinese hamster ovary cell membranes.
In DepthDetails Article