BDBM50292584 CHEMBL4172694
SMILES CO[C@H]1O[C@H](CS(=O)(=O)CCCNC(N)=N)[C@@H](O)[C@H](O)[C@H]1O
InChI Key InChIKey=LXVWBHINTPXQCH-SPFKKGSWSA-N
Data  3 KI
  Tab Delimited (TSV)   2D SDfile   Computed 3D by Vconf -m prep SDfile
Find this compound or compounds like it in BindingDB:
Activity Spreadsheet -- Enzyme Inhibition Constant Data from BindingDB
Found 3 hits for monomerid = 50292584
TargetGlucose-6-phosphate 1-dehydrogenase(Homo sapiens (Human))
University Of Barcelona
Curated by ChEMBL
LigandPNGBDBM50292584(CHEMBL4172694)
Affinity DataKi:  2.23E+4nM. Assay description: Inhibition of recombinant full length human G6PD expressed in Escherichia coli HB351 using G6P as substrate in presence of NADP+ by spectrofluorimetr...
In DepthDetails ArticlePubMed
TargetGlucose-6-phosphate 1-dehydrogenase(Homo sapiens (Human))
University Of Barcelona
Curated by ChEMBL
LigandPNGBDBM50292584(CHEMBL4172694)
Affinity DataKi:  2.23E+4nM. Assay description: Binding affinity to human G6PD
In DepthDetails PubMed
TargetBifunctional glucose-6-phosphate 1-dehydrogenase/6-phosphogluconolactonase(Plasmodium falciparum (isolate 3D7))
University Of Barcelona
Curated by ChEMBL
LigandPNGBDBM50292584(CHEMBL4172694)
Affinity DataKi:  4.29E+4nM. Assay description: Inhibition of Plasmodium falciparum G6PD-6PGL using G6P as substrate in presence of NADP+ by spectrofluorimetric analysis
In DepthDetails ArticlePubMed