BDBM50292716 5'-deoxy-5'-Npyrrolidinothymidine::CHEMBL511875
SMILES Cc1cn([C@H]2C[C@H](O)[C@@H](CN3CCCC3)O2)c(=O)[nH]c1=O
InChI Key InChIKey=XUSBTLVYPZUOAW-QJPTWQEYSA-N
Data  1 KI
  Tab Delimited (TSV)   2D SDfile   Computed 3D by Vconf -m prep SDfile
Find this compound or compounds like it in BindingDB:
Activity Spreadsheet -- Enzyme Inhibition Constant Data from BindingDB
Found 1 hit for monomerid = 50292716
TargetRibonuclease pancreatic(Bison bison (American bison))
Institute Of Technology
Curated by ChEMBL
LigandPNGBDBM50292716(5'-deoxy-5'-Npyrrolidinothymidine | CHEMBL511875)
Affinity DataKi:  4.23E+5nM. Assay description: Inhibition of bovine pancreatic RNase A by spectrophotometric method
In DepthDetails ArticlePubMed