BDBM50292791 4-{3-[2-{2-[({2-[(4-Acetylpiperazin-1-yl)methyl]benzyl}sulfonyl)amino]ethyl}-5-chloro-1-(diphenylmethyl)-1H-indol-3-yl]propyl}benzoicAcid::CHEMBL451642
SMILES CC(=O)N1CCN(Cc2ccccc2CS(=O)(=O)NCCc2c(CCCc3ccc(cc3)C(O)=O)c3cc(Cl)ccc3n2C(c2ccccc2)c2ccccc2)CC1
InChI Key InChIKey=ZQFHHQKWJHGLFH-UHFFFAOYSA-N
Data  1 IC50
  Tab Delimited (TSV)   2D SDfile   Computed 3D by Vconf -m prep SDfile
Find this compound or compounds like it in BindingDB:
Activity Spreadsheet -- Enzyme Inhibition Constant Data from BindingDB
Found 1 hit for monomerid = 50292791
TargetCytosolic phospholipase A2(Homo sapiens (Human))
Wyeth Research
Curated by ChEMBL
LigandPNGBDBM50292791(4-{3-[2-{2-[({2-[(4-Acetylpiperazin-1-yl)methyl]be...)
Affinity DataIC50:  6nM. Assay description: Inhibition of human cytosolic PLA2alpha by GLU micelle assay
In DepthDetails ArticlePubMed