BDBM50294416 4-{[(9S,15R,18S,21S)-15-carbamoyl-21-(carbamoylmethyl)-18-(1H-indol-3-ylmethyl)-8,11,17,20,23-pentaoxo-13-thia-7,10,16,19,22-pentaazaspiro[5.17]tricosan-9-yl]methyl}phenoxyphosphonic acid::CHEMBL555431
SMILES NC(=O)C[C@@H]1NC(=O)C2(CCCCC2)NC(=O)[C@H](Cc2ccc(OP(O)(O)=O)cc2)NC(=O)CSC[C@H](NC(=O)[C@H](Cc2c[nH]c3ccccc23)NC1=O)C(N)=O
InChI Key InChIKey=TYGHMNBMLZMNPC-LJWNLINESA-N
Data  1 Kd
  Tab Delimited (TSV)   2D SDfile   Computed 3D by Vconf -m prep SDfile
Find this compound or compounds like it in BindingDB:
Activity Spreadsheet -- Enzyme Inhibition Constant Data from BindingDB
Found 1 hit for monomerid = 50294416
TargetGrowth factor receptor-bound protein 2(Homo sapiens (Human))
Chinese Academy Of Sciences
Curated by ChEMBL
LigandPNGBDBM50294416(4-{[(9S,15R,18S,21S)-15-carbamoyl-21-(carbamoylmet...)
Affinity DataKd:  1.05E+3nM. Assay description: Binding affinity to GST-tagged recombinant Grb2 SH2 domain by Biacore assay
In DepthDetails ArticlePubMed