BDBM50294736 CHEMBL558496::{3-[3-Benzyl-8-(trifluoromethyl)quinolin-4-yl]phenyl}-[(1-methyl-1H-indol-7-yl)methyl]amine
SMILES Cn1ccc2cccc(CNc3cccc(c3)-c3c(Cc4ccccc4)cnc4c(cccc34)C(F)(F)F)c12
InChI Key InChIKey=IDEFAXMSWQNUAX-UHFFFAOYSA-N
Data  2 IC50  2 EC50
  Tab Delimited (TSV)   2D SDfile   Computed 3D by Vconf -m prep SDfile
Find this compound or compounds like it in BindingDB:
Activity Spreadsheet -- Enzyme Inhibition Constant Data from BindingDB
Found 4 hits for monomerid = 50294736
TargetOxysterols receptor LXR-beta(Homo sapiens (Human))
Wyeth Research
Curated by ChEMBL
LigandPNGBDBM50294736(CHEMBL558496 | {3-[3-Benzyl-8-(trifluoromethyl)qui...)
Affinity DataEC50:  4.17E+3nM. Assay description: Agonist activity at human LXRbeta ligand binding domain (219-462) expressed in human HuH7 cells cotransfected with Gal4-DBD by luciferase transactiva...
In DepthDetails ArticlePubMed
TargetOxysterols receptor LXR-alpha(Homo sapiens (Human))
Wyeth Research
Curated by ChEMBL
LigandPNGBDBM50294736(CHEMBL558496 | {3-[3-Benzyl-8-(trifluoromethyl)qui...)
Affinity DataIC50:  1.42E+6nM. Assay description: Agonist activity at human LXRalpha ligand binding domain (205-448) expressed in human HuH7 cells co-transfected with Gal4-DBD by luciferase transacti...
In DepthDetails ArticlePubMed
TargetOxysterols receptor LXR-beta(Homo sapiens (Human))
Wyeth Research
Curated by ChEMBL
LigandPNGBDBM50294736(CHEMBL558496 | {3-[3-Benzyl-8-(trifluoromethyl)qui...)
Affinity DataIC50:  3.40E+4nM. Assay description: Displacement of [3H]T0901317 from human recombinant N-terminal biotinylated tagged LXRbeta ligand binding domain (154-461) expressed in Escherichia c...
In DepthDetails ArticlePubMed
TargetOxysterols receptor LXR-alpha(Homo sapiens (Human))
Wyeth Research
Curated by ChEMBL
LigandPNGBDBM50294736(CHEMBL558496 | {3-[3-Benzyl-8-(trifluoromethyl)qui...)
Affinity DataEC50:  1.20E+4nM. Assay description: Agonist activity at human LXRalpha ligand binding domain (205-448) expressed in human HuH7 cells cotransfected with Gal4-DBD by luciferase transactiv...
In DepthDetails ArticlePubMed