BDBM50296665 Adamantan-1-yl-[2-(6-morpholin-4-yl-2-pyridin-3-yl)-cyclopropyl]-methanone::CHEMBL556070
SMILES O=C(C1CC1c1ccc(nc1)N1CCOCC1)C12CC3CC(CC(C3)C1)C2
InChI Key InChIKey=SUCUNCCEKWWUHL-UHFFFAOYSA-N
Data  3 KI
  Tab Delimited (TSV)   2D SDfile   Computed 3D by Vconf -m prep SDfile
Find this compound or compounds like it in BindingDB:
Activity Spreadsheet -- Enzyme Inhibition Constant Data from BindingDB
Found 3 hits for monomerid = 50296665
TargetMetabotropic glutamate receptor 1(RAT)
Merz Pharmaceuticals
Curated by ChEMBL
LigandPNGBDBM50296665(Adamantan-1-yl-[2-(6-morpholin-4-yl-2-pyridin-3-yl...)
Affinity DataKi:  24nM. Assay description: Displacement of [3H]E-3-(2-chloro-8-methylquinolin-3-yl)-1-(thiophen-2-yl)prop-2-en-1-one from mGluR1 in rat cerebellar membrane after 14 to 16 hrs b...
In DepthDetails ArticlePubMed
TargetMetabotropic glutamate receptor 1(Homo sapiens (Human))
Merz Pharmaceuticals
Curated by ChEMBL
LigandPNGBDBM50296665(Adamantan-1-yl-[2-(6-morpholin-4-yl-2-pyridin-3-yl...)
Affinity DataKi:  110nM. Assay description: Binding affinity to human GluR1 by FLIPR assay
In DepthDetails ArticlePubMed
TargetMetabotropic glutamate receptor 5(Rattus norvegicus (Rat))
Merz Pharmaceuticals
Curated by ChEMBL
LigandPNGBDBM50296665(Adamantan-1-yl-[2-(6-morpholin-4-yl-2-pyridin-3-yl...)
Affinity DataKi:  2.78E+4nM. Assay description: Displacement of [3H]MPEP from mGluR5 in rat cortical membrane after 60 mins by liquid scintillation counting
In DepthDetails ArticlePubMed