BDBM50296694 1-benzyl-6,7-dimethoxy-3,3-dimethyl-3,4-dihydroisoquinoline::CHEMBL550599
SMILES COc1cc2CC(C)(C)N=C(Cc3ccccc3)c2cc1OC
InChI Key InChIKey=HRSZGKQLHQQWIK-UHFFFAOYSA-N
Data  1 KI  1 IC50
  Tab Delimited (TSV)   2D SDfile   Computed 3D by Vconf -m prep SDfile
Find this compound or compounds like it in BindingDB:
Activity Spreadsheet -- Enzyme Inhibition Constant Data from BindingDB
Found 2 hits for monomerid = 50296694
TargetMetabotropic glutamate receptor 1(RAT)
Merz Pharmaceuticals
Curated by ChEMBL
LigandPNGBDBM50296694(1-benzyl-6,7-dimethoxy-3,3-dimethyl-3,4-dihydroiso...)
Affinity DataKi: >4.00E+4nM. Assay description: Displacement of [3H]E-3-(2-chloro-8-methylquinolin-3-yl)-1-(thiophen-2-yl)prop-2-en-1-one from mGluR1 in rat cerebellar membrane after 14 to 16 hrs b...
In DepthDetails ArticlePubMed
TargetMetabotropic glutamate receptor 1(RAT)
Merz Pharmaceuticals
Curated by ChEMBL
LigandPNGBDBM50296694(1-benzyl-6,7-dimethoxy-3,3-dimethyl-3,4-dihydroiso...)
Affinity DataIC50: >4.00E+4nM. Assay description: Allosteric antagonist activity at mGluR1 in Sprague-Dawley rat cerebellar granule cells assessed as accumulation of [3H]inositol phosphate by liquid ...
In DepthDetails ArticlePubMed