BDBM50296697 (4-chlorophenyl)(2,3,4,5-tetrahydrobenzo[b]oxepin-7-yl)methanone::CHEMBL564597
SMILES Clc1ccc(cc1)C(=O)c1ccc2OCCCCc2c1
InChI Key InChIKey=NZKJWRHDFIPPKE-UHFFFAOYSA-N
Data  1 KI  1 IC50
  Tab Delimited (TSV)   2D SDfile   Computed 3D by Vconf -m prep SDfile
Find this compound or compounds like it in BindingDB:
Activity Spreadsheet -- Enzyme Inhibition Constant Data from BindingDB
Found 2 hits for monomerid = 50296697
TargetMetabotropic glutamate receptor 1(RAT)
Merz Pharmaceuticals
Curated by ChEMBL
LigandPNGBDBM50296697((4-chlorophenyl)(2,3,4,5-tetrahydrobenzo[b]oxepin-...)
Affinity DataKi: >4.00E+4nM. Assay description: Displacement of [3H]E-3-(2-chloro-8-methylquinolin-3-yl)-1-(thiophen-2-yl)prop-2-en-1-one from mGluR1 in rat cerebellar membrane after 14 to 16 hrs b...
In DepthDetails ArticlePubMed
TargetMetabotropic glutamate receptor 1(RAT)
Merz Pharmaceuticals
Curated by ChEMBL
LigandPNGBDBM50296697((4-chlorophenyl)(2,3,4,5-tetrahydrobenzo[b]oxepin-...)
Affinity DataIC50: >4.00E+4nM. Assay description: Allosteric antagonist activity at mGluR1 in Sprague-Dawley rat cerebellar granule cells assessed as accumulation of [3H]inositol phosphate by liquid ...
In DepthDetails ArticlePubMed