BDBM50297768 1-(2-(5-(3-fluorophenoxy)-2-(pyridin-2-yl)-1H-benzo[d]imidazol-6-yl)pyrrolidin-1-yl)ethanone::CHEMBL561283
SMILES CC(=O)N1CCCC1c1cc2nc([nH]c2cc1Oc1cccc(F)c1)-c1ccccn1
InChI Key InChIKey=JNWABOCNQRJLAV-UHFFFAOYSA-N
Data  1 EC50
  Tab Delimited (TSV)   2D SDfile   Computed 3D by Vconf -m prep SDfile
Find this compound or compounds like it in BindingDB:
Activity Spreadsheet -- Enzyme Inhibition Constant Data from BindingDB
Found 1 hit for monomerid = 50297768
TargetHexokinase-4(Homo sapiens (Human))
Banyu Tsukuba Research Institute
Curated by ChEMBL
LigandPNGBDBM50297768(1-(2-(5-(3-fluorophenoxy)-2-(pyridin-2-yl)-1H-benz...)
Affinity DataEC50:  930nM. Assay description: Activation of flag-tagged recombinant human liver glucokinase expressed in Escherichia coli assessed as glucose-6-phosphate dehydrogenase by spectrop...
In DepthDetails ArticlePubMed