BDBM50297790 (2-(5-(4-fluorophenoxy)-2-(pyridin-2-yl)-1H-benzo[d]imidazol-6-yl)pyrrolidin-1-yl)(phenyl)methanone::CHEMBL563600
SMILES Fc1ccc(Oc2cc3[nH]c(nc3cc2C2CCCN2C(=O)c2ccccc2)-c2ccccn2)cc1
InChI Key InChIKey=FZXYPRQEWNRMAC-UHFFFAOYSA-N
Data  1 EC50
  Tab Delimited (TSV)   2D SDfile   Computed 3D by Vconf -m prep SDfile
Find this compound or compounds like it in BindingDB:
Activity Spreadsheet -- Enzyme Inhibition Constant Data from BindingDB
Found 1 hit for monomerid = 50297790
TargetHexokinase-4(Homo sapiens (Human))
Banyu Tsukuba Research Institute
Curated by ChEMBL
LigandPNGBDBM50297790((2-(5-(4-fluorophenoxy)-2-(pyridin-2-yl)-1H-benzo[...)
Affinity DataEC50: >3.00E+4nM. Assay description: Activation of flag-tagged recombinant human liver glucokinase expressed in Escherichia coli assessed as glucose-6-phosphate dehydrogenase by spectrop...
In DepthDetails ArticlePubMed