BDBM50299297 CHEMBL572526::methyl 4-(4-tert-butylbenzylideneamino)benzoate
SMILES COC(=O)c1ccc(cc1)\N=C\c1ccc(cc1)C(C)(C)C
InChI Key InChIKey=SONMMTHLONHMSH-DEDYPNTBSA-N
Data  3 KI
  Tab Delimited (TSV)   2D SDfile   Computed 3D by Vconf -m prep SDfile
Find this compound or compounds like it in BindingDB:
Activity Spreadsheet -- Enzyme Inhibition Constant Data from BindingDB
Found 3 hits for monomerid = 50299297
TargetCarbonic anhydrase 2(Homo sapiens (Human))
Enscm-Umii-Cnrs 5635
Curated by ChEMBL
LigandPNGBDBM50299297(CHEMBL572526 | methyl 4-(4-tert-butylbenzylideneam...)
Affinity DataKi:  158nM. Assay description: Inhibition of human carbonic anhydrase 2-catalyzed CO2 hydration by stopped flow technique
In DepthDetails ArticlePubMed
TargetCarbonic anhydrase 2(Homo sapiens (Human))
Enscm-Umii-Cnrs 5635
Curated by ChEMBL
LigandPNGBDBM50299297(CHEMBL572526 | methyl 4-(4-tert-butylbenzylideneam...)
Affinity DataKi:  780nM. Assay description: Inhibition of human carbonic anhydrase 2-catalyzed CO2 hydration preincubated for 10 mins by stopped-flow assay
In DepthDetails ArticlePubMed
TargetCarbonic anhydrase 1(Homo sapiens (Human))
Enscm/Umii/Umr-Cnrs 5635
Curated by ChEMBL
LigandPNGBDBM50299297(CHEMBL572526 | methyl 4-(4-tert-butylbenzylideneam...)
Affinity DataKi:  7.46E+3nM. Assay description: Inhibition of human carbonic anhydrase 1-catalyzed CO2 hydration preincubated for 10 mins by stopped-flow assay
In DepthDetails ArticlePubMed